{"text_format":"1","workbook":"xlsx","n_sheets":3,"sheets":["Power","ElcPrice_TIMES v2","Demand"],"not_rendered":{"charts":36,"images":0,"macros":1,"external_links":3,"defined_names":119,"comments":0,"pivot_tables":0},"unopened":[],"bounds":{"document_bytes":16777216,"sheet_cells":100000,"rows_first":2000,"rows_last":500,"rows_between":2000,"halvings":0,"cell_chars":16384,"cell_head_chars":4096},"cells_cut":0,"cells_raw":0,"read":"whole","date_system":"1900"}

{"sheet":"Power","index":0,"n_rows":251,"n_cols":139,"rows_kept":251,"cut":false,"hidden":false,"merged":[]}
[" RSA - Electricity Production",{"$f":"IF($E$16,\"\\C\",\"\")","v":"\\C"},null,null,null,null,null,null,null,null,null,null,null,null,null,{"$f":"IF(E17,\"\\C\",\"\")","v":"\\C"},null,null,null,null,null,null,null,null,null,null,null,null,{"$f":"IF($E$18,\"\\C\",\"\")","v":"\\C"},null,null,null,null,null,null,null,null,null,null,null,null,{"$f":"IF($E$19,\"\\C\",\"\")","v":"\\C"}]
[]
[]
[]
[]
[]
[]
[]
[]
[]
[]
[]
[]
[]
["Scenario to refresh",null,null,null,"refresh?"]
[1,"CGERUN10","Best",null,1]
[2,"CGERUN11","Best Forced",null,1]
[3,"CGERUN20","Worst",null,1]
[4,"CGERUN21","Worst Forced",null,1,null,null,null,{"$f":"I43-H43","v":4.2021999359130859}]
[null,null,null,null,null,null,null,null,null,null,null,null,null,null,null,null,null,null,null,null,null,null,null,null,null,null,null,null,null,null,null,null,null,null,null,null,null,null,null,null,{"$f":"AN43/1.6","v":0},null,null,null,null,null,null,null,null,null,null,null,null,null,null,null,null,1000]
[]
[]
["CO2 emissions","\\T",null,null,null,0,{"$f":"F23+1","v":1},{"$f":"G23+1","v":2},3,4,5,6,7,null,null,"\\T",null,null,null,0,{"$f":"T23+1","v":1},{"$f":"U23+1","v":2},3,4,5,6,7,null,"\\T",null,null,null,0,{"$f":"AG23+1","v":1},2,3,4,5,6,7,null,"\\T",null,null,null,0,{"$f":"AT23+1","v":1},2,3,4,5,6,7,null,null,null,null,"Peak Demand"]
[null,{"$f":"$B$16","v":"CGERUN10"},null,null,null,{"$f":"SUMIF($N$3:$N$17,B24,$O$3:$O$17)","v":0},{"$f":"F24","v":0},{"$f":"G24","v":0},0,0,0,0,0,null,null,{"$f":"$B$17","v":"CGERUN11"},null,null,null,{"$f":"SUMIF($N$3:$N$17,P24,$O$3:$O$17)","v":0},{"$f":"T24","v":0},{"$f":"U24","v":0},{"$f":"T24","v":0},{"$f":"W24","v":0},{"$f":"V24","v":0},{"$f":"Y24","v":0},{"$f":"Z24","v":0},null,{"$f":"$B$18","v":"CGERUN20"},null,null,null,{"$f":"SUMIF($N$3:$N$17,AC24,$O$3:$O$17)","v":0},{"$f":"AG24","v":0},{"$f":"AH24","v":0},{"$f":"AG24","v":0},{"$f":"AJ24","v":0},{"$f":"AI24","v":0},{"$f":"AL24","v":0},{"$f":"AM24","v":0},null,{"$f":"$B$19","v":"CGERUN21"},null,null,null,{"$f":"SUMIF($N$3:$N$17,AP24,$O$3:$O$17)","v":0},{"$f":"AT24","v":0},0,0,0,0,0,{"$f":"AX24","v":0},null,null,null,null,null,null,null,null,null,null,null,null,null,null,null,null,null,"Difference Charts"]
[null,"Flow:PWRCO2S",null,null,{"$f":"VLOOKUP(B24,$B$16:$C$19,2,FALSE)","v":"Best"},null,null,null,null,null,null,null,null,null,null,{"$f":"$B25","v":"Flow:PWRCO2S"},null,null,{"$f":"VLOOKUP(P24,$B$16:$C$19,2,FALSE)","v":"Best Forced"},null,null,null,null,null,null,null,null,null,{"$f":"$B25","v":"Flow:PWRCO2S"},null,null,{"$f":"VLOOKUP(AC24,$B$16:$C$19,2,FALSE)","v":"Worst"},null,null,null,null,null,null,null,null,null,{"$f":"$B25","v":"Flow:PWRCO2S"},null,null,{"$f":"VLOOKUP(AP24,$B$16:$C$19,2,FALSE)","v":"Worst Forced"},null,null,null,null,null,null,null,null,null,null,null,null,0,{"$f":"BF25+1","v":1},2,3,4,5,6,7,8]
[null,null,null,null,2010,{"$f":"E26+5","v":2015},2020,2025,2030,2035,2040,2045,2050,null,null,null,null,null,2010,{"$f":"S26+5","v":2015},2020,2025,2030,2035,2040,2045,2050,null,null,null,null,2010,{"$f":"AF26+5","v":2015},2020,2025,2030,2035,2040,2045,2050,null,null,null,null,2010,{"$f":"AS26+5","v":2015},2020,2025,2030,2035,2040,2045,2050,null,null,null,null,{"$f":"AS26","v":2010},2015,2020,2025,2030,2035,2040,2045,{"$f":"BA26","v":2050}]
[null,"X*",null,"CO2",241985.12731933594,226631.87322998047,257572.1745300293,281860.55917358398,231611.31359863281,192893.11022949219,128481.42788696289,130156.93992614746,156249.12512207031,null,null,"X*",null,"CO2",241985.12731933594,226657.54547119141,257368.89422607422,276881.12213134766,226687.568359375,192598.58093261719,128313.22622680664,128414.86570739746,147634.33215332031,null,"X*",null,"CO2",241985.12731933594,227127.89581298828,246697.55169677734,263469.70397949219,227789.72877502441,189197.92840576172,129001.18032836914,121330.85789489746,97930.468505859375,null,"X*",null,"CO2",241985.12731933594,227161.86370849609,246605.98724365234,261740.43835449219,227631.14196777344,188940.23260498047,125286.12783813477,110935.21531677246,83705.202880859375,null,null,{"$f":"MATCH(BE27,E$25:BA$25,)","v":1},{"$f":"C16","v":"Best"},{"$f":"OFFSET($D$53,0,$BD27+BF$25)","v":38.146825784451011},39.355048776045052,44.250885232058081,49.762539263198327,56.597397057000357,65.775129971221389,77.156090711579736,90.506348227859164,106.16649425240635]
[null,null,null,null,null,null,null,null,null,null,null,null,null,null,null,null,null,null,null,null,null,null,null,null,null,null,null,null,null,null,null,null,null,null,null,null,null,null,null,null,null,null,null,null,null,null,null,null,null,null,null,null,null,null,null,{"$f":"MATCH(BE28,E$25:BA$25,)","v":15},{"$f":"C17","v":"Best Forced"},{"$f":"OFFSET($D$53,0,$BD28+BF$25)","v":38.146825784451011},{"$f":"OFFSET($D$53,0,$BD28+BG$25)","v":39.357962394976347},44.223102645000736,49.831529313642207,56.718316212156935,65.84880404120058,77.284702773396859,90.706760751841344,106.45972975334938]
[null,null,null,null,null,null,null,null,null,null,null,null,null,null,null,null,null,null,null,null,null,null,null,null,null,null,null,null,null,null,null,null,null,null,null,null,null,null,null,null,null,null,null,null,null,null,null,null,null,null,null,null,null,null,null,{"$f":"MATCH(BE29,E$25:BA$25,)","v":28},{"$f":"C18","v":"Worst"},{"$f":"OFFSET($D$53,0,$BD29+BF$25)","v":38.146825784451011},39.411967552415291,43.678251935341606,47.671799357054013,51.123100066408284,55.75744120809216,60.629865505444769,65.928094965114056,71.689387389946191]
[null,null,null,null,null,null,null,null,null,null,null,null,null,null,null,null,null,null,null,null,null,null,null,null,null,null,null,null,null,null,null,null,null,null,null,null,null,null,null,null,null,null,null,null,null,null,null,null,null,null,null,null,null,null,null,{"$f":"MATCH(BE30,E$25:BA$25,)","v":41},{"$f":"C19","v":"Worst Forced"},{"$f":"OFFSET($D$53,0,$BD30+BF$25)","v":38.146825784451011},39.415817975253645,43.665763862919484,47.358374938012162,50.209259763592613,54.013838753119721,58.280436727184416,62.884077693371573,67.851404989919359]
{"$rows_left_out":222}
{"sheet":"ElcPrice_TIMES v2","index":1,"n_rows":199,"n_cols":60,"rows_kept":199,"cut":false,"hidden":false,"merged":[]}
[" RSA - Electricity Production",{"$f":"IF($E$16,\"\\C\",\"\")","v":"\\C"},null,null,null,null,null,null,null,null,null,null,null,null,null,null,null,null,{"$f":"IF($E$17,\"\\C\",\"\")","v":"\\C"},null,null,null,null,null,null,null,null,null,null,null,null,null,{"$f":"IF($E$18,\"\\C\",\"\")","v":"\\C"},null,null,null,null,null,null,null,null,null,null,null,null,null,{"$f":"IF($E$19,\"\\C\",\"\")","v":"\\C"},null,null,null,null,null,null,null,null,null,null,null,null,{"$f":"IF($E$19,\"\\C\",\"\")","v":"\\C"}]
[null,null,null,null,null,null,null,null,null,null,null,null,null,null,null,null,null,null,null,null,null,null,null,null,null,null,null,"Upstream Infrastructure"]
[null,null,null,null,null,null,null,null,null,null,null,null,null,null,null,null,null,null,null,null,null,null,null,null,null,"Fuel",null,{"$f":"[3]ITEMS_UPS!B8","v":"Existing Refineries"}]
[null,null,null,null,null,null,null,null,null,null,null,null,null,null,null,null,null,{"$f":"[3]ITEMS_UPS!D9","v":"Refinery Crude Oil Coastal Existing"},null,null,null,null,null,null,null,{"$f":"IF(MID(AC4,2,3)<>\"GAS\",\"O*\",MID(AC4,5,3))","v":"O*"},null,{"$f":"[3]ITEMS_UPS!B9","v":"T"},{"$f":"[3]ITEMS_UPS!C9","v":"UREFOCRCO-E"}]
[null,null,null,null,null,null,null,null,null,null,null,null,null,null,null,null,null,{"$f":"[3]ITEMS_UPS!D10","v":"Refinery Crude Oil Inland Existing"},null,null,null,null,null,null,null,{"$f":"IF(MID(AC5,2,3)<>\"GAS\",\"O*\",MID(AC5,5,3))","v":"O*"},null,{"$f":"[3]ITEMS_UPS!B10","v":"T"},{"$f":"[3]ITEMS_UPS!C10","v":"UREFOCRIN-E"}]
[null,null,null,null,null,null,null,null,null,null,null,null,null,null,null,null,null,{"$f":"[3]ITEMS_UPS!D11","v":"Refinery GTL Existing"},null,null,null,null,null,null,null,"O*",null,{"$f":"[3]ITEMS_UPS!B11","v":"T"},{"$f":"[3]ITEMS_UPS!C11","v":"UGTLGICCO-E"}]
[null,null,null,null,null,null,null,null,null,null,null,null,null,null,null,null,null,{"$f":"[3]ITEMS_UPS!D12","v":"Refinery CTL Existing"},null,null,null,null,null,null,null,"O*",null,{"$f":"[3]ITEMS_UPS!B12","v":"T"},{"$f":"[3]ITEMS_UPS!C12","v":"UCTLCLEIN-E"}]
[null,null,null,null,null,null,null,null,null,null,null,null,null,null,null,null,null,null,null,null,null,null,null,null,null,"O*",null,{"$f":"[3]ITEMS_UPS!B13","v":"New Refineries"}]
[null,null,null,null,null,null,null,null,null,null,null,null,null,null,null,null,null,{"$f":"[3]ITEMS_UPS!D14","v":"Refinery CTL New"},null,null,null,null,null,null,null,"O*",null,{"$f":"[3]ITEMS_UPS!B14","v":"T"},{"$f":"[3]ITEMS_UPS!C14","v":"UCTLCLEIN-N"}]
[null,null,null,null,null,null,null,null,null,null,null,null,null,null,null,null,null,{"$f":"[3]ITEMS_UPS!D15","v":"Refinery GTL New - Inland"},null,null,null,null,null,null,null,"O*",null,{"$f":"[3]ITEMS_UPS!B15","v":"T"},{"$f":"[3]ITEMS_UPS!C15","v":"UGTLGASIN-N"}]
[null,null,null,null,null,null,null,null,null,null,null,null,null,null,null,null,null,null,null,null,null,null,null,null,null,"O*",null,{"$f":"[3]ITEMS_UPS!B23","v":"T"}]
[null,null,null,null,null,null,null,null,null,null,null,null,null,null,null,null,null,{"$f":"[3]ITEMS_UPS!D24","v":"Pipeline Gas Indigenous Ibhubezi"},null,null,null,null,null,null,null,"GIB",null,{"$f":"[3]ITEMS_UPS!B24","v":"T"},{"$f":"[3]ITEMS_UPS!C24","v":"UGASGIB-N"}]
[null,null,null,null,"in 2015 c/kWh",null,{"$f":"G16*(1.06^5)","v":41.627277891748811},{"$f":"H16*(1.06^5)","v":47.52171263356594},59.324733719922449,64.599120910364107,77.756442501374522,82.559079330316123,88.483425995968489,93.558245006039911,100.67141048751039,null,null,{"$f":"[3]ITEMS_UPS!D25","v":"Pipeline Gas Northern Mozambique"},null,null,null,null,null,null,null,"GRM",null,{"$f":"[3]ITEMS_UPS!B25","v":"T"},{"$f":"[3]ITEMS_UPS!C25","v":"UGASGRM-N"}]
[null,null,null,null,null,null,null,null,null,null,null,null,null,null,null,null,null,{"$f":"[3]ITEMS_UPS!D26","v":"Pipeline Gas Southern Mozambique"},null,null,null,null,null,null,null,"GRS",null,{"$f":"[3]ITEMS_UPS!B26","v":"T"},{"$f":"[3]ITEMS_UPS!C26","v":"UGASGRS-N"}]
["Scenario to refresh",null,null,null,"refresh?",null,2010,{"$f":"G15+5","v":2015},{"$f":"H15+5","v":2020},2025,2030,2035,2040,2045,2050,null,null,{"$f":"[3]ITEMS_UPS!D27","v":"Pipeline Gas Indigenous Shale"},null,null,null,null,null,null,null,"GIH",null,{"$f":"[3]ITEMS_UPS!B27","v":"T"},{"$f":"[3]ITEMS_UPS!C27","v":"UGASGIH-N"}]
[1,{"$f":"Power!B16","v":"CGERUN10"},null,{"$f":"Power!C16","v":"Best"},1,{"$f":"D16","v":"Best"},{"$f":"E136","v":31.106323618775821},{"$f":"F136","v":35.510988154024297},{"$f":"G136","v":44.330892125314605},48.27222106023217,58.104137152141732,61.692946773875867,66.119963238676377,69.912163219768274,75.227534260745813,null,null,{"$f":"[3]ITEMS_UPS!D28","v":"LNG Terminal"},null,null,null,null,null,null,null,"O*",null,{"$f":"[3]ITEMS_UPS!B28","v":"T"},{"$f":"[3]ITEMS_UPS!C28","v":"ULGTGRL-N"}]
[2,{"$f":"Power!B17","v":"CGERUN11"},null,{"$f":"Power!C17","v":"Best Forced"},1,{"$f":"D17","v":"Best Forced"},{"$f":"V136","v":31.106323618775821},{"$f":"W136","v":35.504093302147709},44.318100140388523,49.578372884087081,58.614741913841883,62.392072459635294,66.539075229389127,70.260854484115143,75.115576122040522]
[3,{"$f":"Power!B18","v":"CGERUN20"},null,{"$f":"Power!C18","v":"Worst"},1,"Worst",{"$f":"AJ136","v":31.106323618775821},{"$f":"AK136","v":35.406352845546962},44.039011515927683,47.784147353955731,52.801756104462342,53.757951932803259,54.964887243029814,55.748289788375438,57.302921197786929,null,null,null,null,null,null,null,null,null,null,"UNIQUE List"]
[4,{"$f":"Power!B19","v":"CGERUN21"},null,{"$f":"Power!C19","v":"Worst Forced"},1,"Worst Forced",{"$f":"AX136","v":31.106323618775821},{"$f":"AY136","v":35.403140585487179},44.046851548272976,47.909293013361257,55.616193935535549,68.697508677913603,68.498251063898735,68.096402209982969,68.621534026708304,null,null,null,null,null,null,null,null,null,null,{"$f":"Z11","v":"O*"},null,null,"Oil Products"]
[null,null,null,null,null,null,null,null,null,null,null,null,null,null,null,null,null,null,null,null,null,null,null,null,null,{"$f":"Z12","v":"GIB"},null,null,"Ibhubezi"]
[null,null,null,null,null,null,null,null,null,null,null,null,null,null,null,null,null,null,null,null,null,null,null,null,null,{"$f":"Z13","v":"GRM"},null,null,"Northern Mozambique"]
[null,null,null,null,null,null,null,null,null,null,null,null,null,null,null,null,null,null,null,null,null,null,null,null,null,{"$f":"Z14","v":"GRS"},null,null,"Shale"]
["Fuel Costs",null,null,null,null,null,null,null,null,null,null,null,null,null,null,null,null,"Fuel Costs",null,null,null,null,null,null,null,{"$f":"Z15","v":"GIH"},null,null,"LNG",null,null,"Fuel Costs",null,null,null,null,null,null,null,null,null,null,null,null,null,"Fuel Costs"]
["Production",null,null,null,null,null,null,null,null,null,null,null,null,null,null,null,null,"Production",null,null,null,null,null,null,null,null,null,null,null,null,null,"Production",null,null,null,null,null,null,null,null,null,null,null,null,null,"Production"]
[]
["Power Sector Fuel Marginals (short run)","\\T",null,null,null,null,null,null,null,null,null,null,null,null,null,null,null,"Power Sector Fuel Marginals (short run)","\\T",null,null,null,null,null,null,null,null,null,null,null,null,"Power Sector Fuel Marginals (short run)","\\T",null,null,null,null,null,null,null,null,null,null,null,null,"Power Sector Fuel Marginals (short run)","\\T"]
[null,{"$f":"B16","v":"CGERUN10"},null,null,null,null,null,null,null,null,null,null,null,null,null,null,null,null,{"$f":"B17","v":"CGERUN11"},null,null,null,null,null,null,null,null,null,null,null,null,null,{"$f":"B18","v":"CGERUN20"},null,null,null,null,null,null,null,null,null,null,null,null,null,{"$f":"B19","v":"CGERUN21"}]
[null,"EQ_COMBAL.M",null,null,null,null,null,null,null,null,null,null,null,null,null,null,null,null,"EQ_COMBAL.M",null,null,null,null,null,null,null,null,null,null,null,null,null,"EQ_COMBAL.M",null,null,null,null,null,null,null,null,null,null,null,null,null,"EQ_COMBAL.M"]
[null,null,null,null,2010,{"$f":"E29+5","v":2015},{"$f":"F29+5","v":2020},2025,2030,2035,2040,2045,2050,null,null,null,null,null,null,null,null,2010,{"$f":"V29+5","v":2015},{"$f":"W29+5","v":2020},2025,2030,2035,2040,2045,2050,null,null,null,null,null,2010,{"$f":"AJ29+5","v":2015},{"$f":"AK29+5","v":2020},2025,2030,2035,2040,2045,2050,null,null,null,null,null,2010,{"$f":"AX29+5","v":2015},{"$f":"AY29+5","v":2020},2025,2030,2035,2040,2045,2050]
[null,"PWRBIG",null,null,0,0,0,0,0,0,0,0,0,null,null,null,null,null,"PWRBIG",null,null,0,0,0,0,0,0,0,0,0,null,null,"PWRBIG",null,null,0,0,0,0,0,0,0,0,0,null,null,"PWRBIG",null,null,0,0,0,0,0,0,0,0,0]
{"$rows_left_out":170}
{"sheet":"Demand","index":2,"n_rows":51,"n_cols":14,"rows_kept":51,"cut":false,"hidden":false,"merged":[]}
[]
[]
[]
[]
[]
[]
[null,null,null,null,null,1000]
[]
[null,null,null,null,"From IRP2010 update"]
[null,null,null,null,null,"Green Shoots","Traditional Sectors","Weathering the Storm","Adrift in troubled waters","Moderate Growth","SO IRP moderate","SO IRP Low","Best-Least.Cost","Worst-Least.Cost"]
[null,null,null,null,2010,250.273,250.273,250.273,250.27600000000001,250.273,252.94300000000001,252.94300000000001,{"$f":"INDEX(Power!$BF$62:$BN$65,1,MATCH(E11,Power!$BF$26:$BN$26,0))","v":265.42480628316599},{"$f":"INDEX(Power!$BF$62:$BN$65,3,MATCH(E11,Power!$BF$26:$BN$26,0))","v":265.42480628316599}]
[null,null,null,null,2011,255.80799999999999,255.88800000000001,255.80799999999999,255.37799999999999,255.375,255.49299999999999,255.49299999999999,{"$f":"INDEX(Power!$BF$62:$BN$65,1,MATCH(E12,Power!$BF$26:$BN$26,0))","v":{"$error":"#N/A"}},{"$f":"INDEX(Power!$BF$62:$BN$65,3,MATCH(E12,Power!$BF$26:$BN$26,0))","v":{"$error":"#N/A"}}]
[null,null,null,null,2012,251.98,252.06299999999999,251.98,251.53100000000001,251.53299999999999,255.35300000000001,254.56200000000001,{"$f":"INDEX(Power!$BF$62:$BN$65,1,MATCH(E13,Power!$BF$26:$BN$26,0))","v":{"$error":"#N/A"}},{"$f":"INDEX(Power!$BF$62:$BN$65,3,MATCH(E13,Power!$BF$26:$BN$26,0))","v":{"$error":"#N/A"}}]
[null,null,null,null,2013,258.76900000000001,259.64600000000002,257.45,257.62900000000002,258.78199999999998,265.45699999999999,265.58600000000001,{"$f":"INDEX(Power!$BF$62:$BN$65,1,MATCH(E14,Power!$BF$26:$BN$26,0))","v":{"$error":"#N/A"}},{"$f":"INDEX(Power!$BF$62:$BN$65,3,MATCH(E14,Power!$BF$26:$BN$26,0))","v":{"$error":"#N/A"}}]
[null,null,null,null,2014,265.46499999999997,268.18400000000003,263.09399999999999,263.98599999999999,266.14100000000002,274.04399999999998,271.76100000000002,{"$f":"INDEX(Power!$BF$62:$BN$65,1,MATCH(E15,Power!$BF$26:$BN$26,0))","v":{"$error":"#N/A"}},{"$f":"INDEX(Power!$BF$62:$BN$65,3,MATCH(E15,Power!$BF$26:$BN$26,0))","v":{"$error":"#N/A"}}]
[null,null,null,null,2015,271.42399999999998,276.78800000000001,267.13900000000001,268.226,272.91199999999998,285.52600000000001,280.65199999999999,{"$f":"INDEX(Power!$BF$62:$BN$65,1,MATCH(E16,Power!$BF$26:$BN$26,0))","v":269.15263820737084},{"$f":"INDEX(Power!$BF$62:$BN$65,3,MATCH(E16,Power!$BF$26:$BN$26,0))","v":269.54355386234562}]
[null,null,null,null,2016,279.38400000000001,287.71699999999998,272.91399999999999,273.47800000000001,281.84300000000002,298.33199999999999,290.65499999999997,{"$f":"INDEX(Power!$BF$62:$BN$65,1,MATCH(E17,Power!$BF$26:$BN$26,0))","v":{"$error":"#N/A"}},{"$f":"INDEX(Power!$BF$62:$BN$65,3,MATCH(E17,Power!$BF$26:$BN$26,0))","v":{"$error":"#N/A"}}]
[null,null,null,null,2017,287.47899999999998,298.91300000000001,278.50599999999997,277.8,290.54599999999999,310.41000000000003,299.726,{"$f":"INDEX(Power!$BF$62:$BN$65,1,MATCH(E18,Power!$BF$26:$BN$26,0))","v":{"$error":"#N/A"}},{"$f":"INDEX(Power!$BF$62:$BN$65,3,MATCH(E18,Power!$BF$26:$BN$26,0))","v":{"$error":"#N/A"}}]
[null,null,null,null,2018,296.37900000000002,311.315,284.61500000000001,282.16199999999998,300.12599999999998,319.52300000000002,305.76,{"$f":"INDEX(Power!$BF$62:$BN$65,1,MATCH(E19,Power!$BF$26:$BN$26,0))","v":{"$error":"#N/A"}},{"$f":"INDEX(Power!$BF$62:$BN$65,3,MATCH(E19,Power!$BF$26:$BN$26,0))","v":{"$error":"#N/A"}}]
[null,null,null,null,2019,305.41800000000001,324.226,290.61599999999999,286.572,309.964,327.43799999999999,310.512,{"$f":"INDEX(Power!$BF$62:$BN$65,1,MATCH(E20,Power!$BF$26:$BN$26,0))","v":{"$error":"#N/A"}},{"$f":"INDEX(Power!$BF$62:$BN$65,3,MATCH(E20,Power!$BF$26:$BN$26,0))","v":{"$error":"#N/A"}}]
[null,null,null,null,2020,314.79000000000002,337.51499999999999,296.483,290.93700000000001,319.77,336.178,315.93,{"$f":"INDEX(Power!$BF$62:$BN$65,1,MATCH(E21,Power!$BF$26:$BN$26,0))","v":301.75530626917157},{"$f":"INDEX(Power!$BF$62:$BN$65,3,MATCH(E21,Power!$BF$26:$BN$26,0))","v":297.36969445065671}]
[null,null,null,null,2021,324.303,350.68599999999998,302.44799999999998,295.69299999999998,329.11599999999999,340.94600000000003,317.49900000000002,{"$f":"INDEX(Power!$BF$62:$BN$65,1,MATCH(E22,Power!$BF$26:$BN$26,0))","v":{"$error":"#N/A"}},{"$f":"INDEX(Power!$BF$62:$BN$65,3,MATCH(E22,Power!$BF$26:$BN$26,0))","v":{"$error":"#N/A"}}]
[null,null,null,null,2022,333.92899999999997,364.27300000000002,308.428,300.25799999999998,338.887,349.16399999999999,322.214,{"$f":"INDEX(Power!$BF$62:$BN$65,1,MATCH(E23,Power!$BF$26:$BN$26,0))","v":{"$error":"#N/A"}},{"$f":"INDEX(Power!$BF$62:$BN$65,3,MATCH(E23,Power!$BF$26:$BN$26,0))","v":{"$error":"#N/A"}}]
[null,null,null,null,2023,343.56099999999998,378.4,314.55599999999998,304.24,348.47699999999998,358.29899999999998,327.65800000000002,{"$f":"INDEX(Power!$BF$62:$BN$65,1,MATCH(E24,Power!$BF$26:$BN$26,0))","v":{"$error":"#N/A"}},{"$f":"INDEX(Power!$BF$62:$BN$65,3,MATCH(E24,Power!$BF$26:$BN$26,0))","v":{"$error":"#N/A"}}]
[null,null,null,null,2024,353.65100000000001,392.64400000000001,320.80799999999999,308.28399999999999,357.76,368.13600000000002,333.61200000000002,{"$f":"INDEX(Power!$BF$62:$BN$65,1,MATCH(E25,Power!$BF$26:$BN$26,0))","v":{"$error":"#N/A"}},{"$f":"INDEX(Power!$BF$62:$BN$65,3,MATCH(E25,Power!$BF$26:$BN$26,0))","v":{"$error":"#N/A"}}]
[null,null,null,null,2025,364.05599999999998,407.63499999999999,326.798,312.24299999999999,367.21800000000002,377.49599999999998,338.99700000000001,{"$f":"INDEX(Power!$BF$62:$BN$65,1,MATCH(E26,Power!$BF$26:$BN$26,0))","v":337.57863864208866},{"$f":"INDEX(Power!$BF$62:$BN$65,3,MATCH(E26,Power!$BF$26:$BN$26,0))","v":323.14328025395895}]
[null,null,null,null,2026,366.03399999999999,414.262,323.93,307.33300000000003,367.45800000000003,379.87099999999998,337.06400000000002,{"$f":"INDEX(Power!$BF$62:$BN$65,1,MATCH(E27,Power!$BF$26:$BN$26,0))","v":{"$error":"#N/A"}},{"$f":"INDEX(Power!$BF$62:$BN$65,3,MATCH(E27,Power!$BF$26:$BN$26,0))","v":{"$error":"#N/A"}}]
[null,null,null,null,2027,376.61099999999999,428.84899999999999,329.58800000000002,311.45400000000001,376.47300000000001,391,343.74700000000001,{"$f":"INDEX(Power!$BF$62:$BN$65,1,MATCH(E28,Power!$BF$26:$BN$26,0))","v":{"$error":"#N/A"}},{"$f":"INDEX(Power!$BF$62:$BN$65,3,MATCH(E28,Power!$BF$26:$BN$26,0))","v":{"$error":"#N/A"}}]
[null,null,null,null,2028,387.50599999999997,444.017,334.88,315.637,385.36900000000003,402.29599999999999,350.42099999999999,{"$f":"INDEX(Power!$BF$62:$BN$65,1,MATCH(E29,Power!$BF$26:$BN$26,0))","v":{"$error":"#N/A"}},{"$f":"INDEX(Power!$BF$62:$BN$65,3,MATCH(E29,Power!$BF$26:$BN$26,0))","v":{"$error":"#N/A"}}]
[null,null,null,null,2029,398.40800000000002,459.47199999999998,340.31700000000001,319.30099999999999,393.68799999999999,407.17500000000001,351.35700000000003,{"$f":"INDEX(Power!$BF$62:$BN$65,1,MATCH(E30,Power!$BF$26:$BN$26,0))","v":{"$error":"#N/A"}},{"$f":"INDEX(Power!$BF$62:$BN$65,3,MATCH(E30,Power!$BF$26:$BN$26,0))","v":{"$error":"#N/A"}}]
{"$rows_left_out":21}